affinity-n
type: LexicalEntry
canonical form: affinity
sense: 04695997-n
part of speech: noun
sense: 04755038-n
sense: 11442936-n
sense: 11446892-n
sense: 13833622-n
sense: 13834508-n
sense: 13835495-n

04695997-n
type: LexicalConcept
in scheme: en-word.net
definition: a natural attraction or feeling of kinship
example: an affinity for politics
example: the mysterious affinity between them
example: James's affinity with Sam
ili: i61691
lexfile: noun.attribute
part of speech: noun
hypernym: 04695595-n

04755038-n
type: LexicalConcept
in scheme: en-word.net
definition: inherent resemblance between persons or things
ili: i61975
lexfile: noun.attribute
part of speech: noun
hypernym: 04754685-n

chemical attraction-n
type: LexicalEntry
canonical form: chemical attraction
sense: 11442936-n
part of speech: noun

11442936-n
type: LexicalConcept
in scheme: en-word.net
definition: the force attracting atoms to each other and binding them together in a molecule
example: basic dyes have an affinity for wool and silk
ili: i97610
lexfile: noun.phenomenon
part of speech: noun
hypernym: 11479041-n

11446892-n
type: LexicalConcept
in scheme: en-word.net
definition: (immunology) the attraction between an antigen and an antibody
ili: i97631
lexfile: noun.phenomenon
part of speech: noun
domain topic: 06061073-n
hypernym: 11446644-n

kinship-n
type: LexicalEntry
canonical form: kinship
sense: 13833622-n
part of speech: noun

13833622-n
type: LexicalConcept
in scheme: en-word.net
definition: a close connection marked by community of interests or similarity in nature or character
example: found a natural affinity with the immigrants
example: felt a deep kinship with the other students
example: anthropology's kinship with the humanities
ili: i109484
lexfile: noun.relation
part of speech: noun
hypernym: 00032220-n

phylogenetic relation-n
type: LexicalEntry
canonical form: phylogenetic relation
sense: 13834508-n
part of speech: noun

13834508-n
type: LexicalConcept
in scheme: en-word.net
definition: (biology) state of relationship between organisms or groups of organisms resulting in resemblance in structure or structural parts
example: in anatomical structure prehistoric man shows close affinity with modern humans
ili: i109488
lexfile: noun.relation
part of speech: noun
domain topic: 06047178-n
hypernym: 13834819-n

13835495-n
type: LexicalConcept
in scheme: en-word.net
definition: (anthropology) kinship by marriage or adoption; not a blood relationship
ili: i109491
lexfile: noun.relation
part of speech: noun
domain topic: 06152997-n
hypernym: 13834819-n