duel-n
type: LexicalEntry
canonical form: duel
sense: 01175274-n
part of speech: noun

affaire d'honneur-n
type: LexicalEntry
canonical form: affaire d'honneur
sense: 01175274-n
part of speech: noun

01175274-n
type: LexicalConcept
in scheme: en-word.net
definition: a prearranged fight with deadly weapons by two people (accompanied by seconds) in order to settle a quarrel over a point of honor
ili: i41545
lexfile: noun.act
part of speech: noun
hypernym: 01173452-n