accomplice-n
type: LexicalEntry
canonical form: accomplice
sense: 09780399-n
part of speech: noun

confederate-n
type: LexicalEntry
canonical form: confederate
sense: 09780399-n
part of speech: noun

09780399-n
type: LexicalConcept
in scheme: en-word.net
definition: a person who joins with another in carrying out some plan (especially an unethical or illegal plan)
ili: i88049
lexfile: noun.person
part of speech: noun
hypernym: 09835195-n