accommodating-a
type: LexicalEntry
canonical form: accommodating
sense: https://en-word.net/lemma/accommodating-a#00020824-a
part of speech: adjective

accommodative-a
type: LexicalEntry
canonical form: accommodative
sense: https://en-word.net/lemma/accommodative-a#00020824-a
part of speech: adjective
sense: 00046559-s
sense: 00515313-s

https://en-word.net/synset/00020824-a
type: LexicalConcept
in scheme: en-word.net
definition: helpful in bringing about a harmonious adaptation
example: the warden was always accommodating in allowing visitors in
example: made a special effort to be accommodating
ili: i99
lexfile: adj.all
part of speech: adjective
also: https://en-word.net/synset/01137376-a
also: https://en-word.net/synset/01199079-a
also: https://en-word.net/synset/01374976-a
similar: 00021147-s

reconciling-a
type: LexicalEntry
canonical form: reconciling
sense: 00046559-s
part of speech: adjective

00046559-s
type: LexicalConcept
in scheme: en-word.net
definition: tending to reconcile or accommodate; bringing into harmony
ili: i236
lexfile: adj.all
part of speech: adjective satellite
similar: https://en-word.net/synset/00046329-a

cooperative-a
type: LexicalEntry
canonical form: cooperative
sense: 00515313-s
part of speech: adjective

00515313-s
type: LexicalConcept
in scheme: en-word.net
definition: willing to adjust to differences in order to obtain agreement
ili: i2883
lexfile: adj.all
part of speech: adjective satellite
similar: https://en-word.net/synset/00515090-a