acceptance-n
type: LexicalEntry
canonical form: acceptance
sense: 00083345-n
part of speech: noun
sense: 00181262-n
sense: 04645532-n
sense: 06203462-n
sense: 07190724-n
sense: 13402775-n
sense: 13955454-n

00083345-n
type: LexicalConcept
in scheme: en-word.net
definition: the act of taking something that is offered
example: her acceptance of the gift encouraged him
example: he anticipated their acceptance of his offer
ili: i35841
lexfile: noun.act
part of speech: noun
hypernym: 00078239-n

adoption-n
type: LexicalEntry
canonical form: adoption
sense: 00181262-n
part of speech: noun

acceptation-n
type: LexicalEntry
canonical form: acceptation
sense: 00181262-n
part of speech: noun

espousal-n
type: LexicalEntry
canonical form: espousal
sense: 00181262-n
part of speech: noun

00181262-n
type: LexicalConcept
in scheme: en-word.net
definition: the act of accepting with approval; favorable reception
example: its adoption by society
example: the proposal found wide acceptance
ili: i36361
lexfile: noun.act
part of speech: noun
hypernym: 01217882-n

toleration-n
type: LexicalEntry
canonical form: toleration
sense: 04645532-n
part of speech: noun

sufferance-n
type: LexicalEntry
canonical form: sufferance
sense: 04645532-n
part of speech: noun

04645532-n
type: LexicalConcept
in scheme: en-word.net
definition: a disposition to tolerate or accept people or situations
example: all people should practice toleration and live together in peace
ili: i61448
lexfile: noun.attribute
part of speech: noun
hypernym: 04645280-n

credence-n
type: LexicalEntry
canonical form: credence
sense: 06203462-n
part of speech: noun

06203462-n
type: LexicalConcept
in scheme: en-word.net
definition: the mental attitude that something is believable and should be accepted as true
example: he gave credence to the gossip
example: acceptance of Newtonian mechanics was unquestioned for 200 years
ili: i69081
lexfile: noun.cognition
part of speech: noun
hypernym: 06202938-n

07190724-n
type: LexicalConcept
in scheme: en-word.net
definition: (contract law) words signifying consent to the terms of an offer (thereby creating a contract)
ili: i74362
lexfile: noun.communication
part of speech: noun
domain topic: 06171758-n
hypernym: 07190226-n

banker's acceptance-n
type: LexicalEntry
canonical form: banker's acceptance
sense: 13402775-n
part of speech: noun

13402775-n
type: LexicalConcept
in scheme: en-word.net
definition: a time draft drawn on and accepted by a bank
ili: i107041
lexfile: noun.possession
part of speech: noun
hypernym: 13398441-n

13955454-n
type: LexicalConcept
in scheme: en-word.net
definition: the state of being acceptable and accepted
example: torn jeans received no acceptance at the country club
ili: i110159
lexfile: noun.state
part of speech: noun
hypernym: 13950416-n