wean-v
type: LexicalEntry
canonical form: wean
sense: 01189491-v
part of speech: verb

ablactate-v
type: LexicalEntry
canonical form: ablactate
sense: 01189491-v
part of speech: verb

01189491-v
type: LexicalConcept
in scheme: en-word.net
definition: gradually deprive (infants and young mammals) of mother's milk
example: she weaned her baby when he was 3 months old and started him on powdered milk
example: The kitten was weaned and fed by its owner with a bottle
ili: i27552
lexfile: verb.consumption
part of speech: verb
entails: 01188961-v
hypernym: 02318230-v