Yalu-n
type: LexicalEntry
canonical form: Yalu
sense: 09504415-n
part of speech: noun

Yalu River-n
type: LexicalEntry
canonical form: Yalu River
sense: 09504415-n
part of speech: noun

09504415-n
type: LexicalConcept
in scheme: en-word.net
definition: river in eastern Asia; rises in North Korea and flows southwest to Korea Bay (forming part of the border between North Korea and China)
ili: i86451
lexfile: noun.object
part of speech: noun
domain region: 08740839-n
instance hypernym: 09434308-n