Wilmington-n
type: LexicalEntry
canonical form: Wilmington
sense: 09092861-n
part of speech: noun
sense: 09151860-n

09092861-n
type: LexicalConcept
in scheme: en-word.net
definition: the largest city in Delaware
ili: i84287
lexfile: noun.location
part of speech: noun
instance hypernym: 08542298-n
mero part: 03177268-n

09151860-n
type: LexicalConcept
in scheme: en-word.net
definition: a town in southeastern North Carolina on the Cape Fear River
ili: i84608
lexfile: noun.location
part of speech: noun
instance hypernym: 08683242-n