Whitehorse-n
type: LexicalEntry
canonical form: Whitehorse
sense: 08849874-n
part of speech: noun

08849874-n
type: LexicalConcept
in scheme: en-word.net
definition: the provincial capital of the Yukon Territory
ili: i83243
lexfile: noun.location
part of speech: noun
instance hypernym: 08713012-n