Venus-n
type: LexicalEntry
canonical form: Venus
sense: 01960380-n
part of speech: noun
sense: 09493892-n
sense: 09578256-n

genus Venus-n
type: LexicalEntry
canonical form: genus Venus
sense: 01960380-n
part of speech: noun

01960380-n
type: LexicalConcept
in scheme: en-word.net
definition: type genus of the family Veneridae: genus of edible clams with thick oval shells
ili: i45630
lexfile: noun.animal
part of speech: noun
hypernym: 01942239-n
mero member: 01960679-n

09493892-n
type: LexicalConcept
in scheme: en-word.net
definition:
  value: the second nearest planet to the sun; it is peculiar in that its rotation is slow and retrograde (in the opposite sense of the Earth and all other planets except Uranus); it is visible from Earth as an early ‘morning star’ or an ‘evening star’
example: before it was known that they were the same object the evening star was called Venus and the morning star was called Lucifer
ili: i86389
lexfile: noun.object
part of speech: noun
instance hypernym: 09479499-n
instance hypernym: 09335905-n

Urania-n
type: LexicalEntry
canonical form: Urania
sense: 09578256-n
part of speech: noun

09578256-n
type: LexicalConcept
in scheme: en-word.net
definition: goddess of love; counterpart of Greek Aphrodite
ili: i86870
lexfile: noun.person
part of speech: noun
instance hypernym: 09575810-n