Venice-n
type: LexicalEntry
canonical form: Venice
sense: 08831116-n
part of speech: noun

Venezia-n
type: LexicalEntry
canonical form: Venezia
sense: 08831116-n
part of speech: noun

08831116-n
type: LexicalConcept
in scheme: en-word.net
definition: the provincial capital of Veneto; built on 118 islands within a lagoon in the Gulf of Venice; has canals instead of streets; one of Italy's major ports and a famous tourist attraction
ili: i83162
lexfile: noun.location
part of speech: noun
instance hypernym: 08542298-n
mero member: 09736850-n
mero part: 08831438-n