Tuscany-n
type: LexicalEntry
canonical form: Tuscany
sense: 08829834-n
part of speech: noun

Toscana-n
type: LexicalEntry
canonical form: Toscana
sense: 08829834-n
part of speech: noun

08829834-n
type: LexicalConcept
in scheme: en-word.net
definition: a region in central Italy with capital Florence
ili: i83154
lexfile: noun.location
part of speech: noun
instance hypernym: 08821234-n
mero member: 09737092-n
mero part: 08827762-n
mero part: 08830018-n