Tonga-n
type: LexicalEntry
canonical form: Tonga
sense: 07008689-n
part of speech: noun
sense: 09059608-n

Tonga language-n
type: LexicalEntry
canonical form: Tonga language
sense: 07008689-n
part of speech: noun

07008689-n
type: LexicalConcept
in scheme: en-word.net
definition: the language of the Tongan people of south central Africa (Zambia and Zimbabwe)
ili: i73419
lexfile: noun.communication
part of speech: noun
hypernym: 07004640-n

Kingdom of Tonga-n
type: LexicalEntry
canonical form: Kingdom of Tonga
sense: 09059608-n
part of speech: noun

Friendly Islands-n
type: LexicalEntry
canonical form: Friendly Islands
sense: 09059608-n
part of speech: noun

09059608-n
type: LexicalConcept
in scheme: en-word.net
definition: a monarchy on a Polynesian archipelago in the South Pacific; achieved independence from the United Kingdom in 1970
ili: i84147
lexfile: noun.location
part of speech: noun
instance hypernym: 08562388-n
mero member: 09769741-n