Toledo-n
type: LexicalEntry
canonical form: Toledo
sense: 09049662-n
part of speech: noun
sense: 09154108-n

09049662-n
type: LexicalConcept
in scheme: en-word.net
definition: a city in central Spain on the Tagus river; famous for steel and swords since the first century
ili: i84099
lexfile: noun.location
part of speech: noun
instance hypernym: 08542298-n

09154108-n
type: LexicalConcept
in scheme: en-word.net
definition: an industrial city in northwestern Ohio on Lake Erie
ili: i84621
lexfile: noun.location
part of speech: noun
instance hypernym: 08542298-n