Tandy-n
type: LexicalEntry
canonical form: Tandy
sense: 11350499-n
part of speech: noun

Jessica Tandy-n
type: LexicalEntry
canonical form: Jessica Tandy
sense: 11350499-n
part of speech: noun

11350499-n
type: LexicalConcept
in scheme: en-word.net
definition: United States actress (born in England) who made many stage appearances, often with her husband Hume Cronyn (1909-1994)
ili: i97096
lexfile: noun.person
part of speech: noun
instance hypernym: 09787123-n