Tamil Nadu-n
type: LexicalEntry
canonical form: Tamil Nadu
sense: 08925435-n
part of speech: noun

Madras-n
type: LexicalEntry
canonical form: Madras
sense: 08925435-n
part of speech: noun

08925435-n
type: LexicalConcept
in scheme: en-word.net
definition: a state in southeastern India on the Bay of Bengal (south of Andhra Pradesh); formerly Madras
ili: i83541
lexfile: noun.location
part of speech: noun
instance hypernym: 08671935-n