television station-n
type: LexicalEntry
canonical form: television station
sense: 04413485-n
part of speech: noun

TV station-n
type: LexicalEntry
canonical form: TV station
sense: 04413485-n
part of speech: noun

04413485-n
type: LexicalConcept
in scheme: en-word.net
definition: station for the production and transmission of television broadcasts
ili: i60092
lexfile: noun.artifact
part of speech: noun
hypernym: 02906730-n
mero part: 02906913-n