Surya-n
type: LexicalEntry
canonical form: Surya
sense: 09552323-n
part of speech: noun

09552323-n
type: LexicalConcept
in scheme: en-word.net
definition: an important god of later Hinduism; the sun god or the sun itself worshipped as the source of warmth and light
ili: i86722
lexfile: noun.person
part of speech: noun
instance hypernym: 09546113-n