Stonehenge-n
type: LexicalEntry
canonical form: Stonehenge
sense: 08674381-n
part of speech: noun

08674381-n
type: LexicalConcept
in scheme: en-word.net
definition: an ancient megalithic monument in southern England; probably used for ritual purposes
ili: i82457
lexfile: noun.location
part of speech: noun
instance hypernym: 08617999-n