Staten Island-n
type: LexicalEntry
canonical form: Staten Island
sense: 09145948-n
part of speech: noun

09145948-n
type: LexicalConcept
in scheme: en-word.net
definition: a borough of New York City, it is the southernmost, least populated, and third largest of the New York City boroughs
ili: i84573
lexfile: noun.location
part of speech: noun
instance hypernym: 08558095-n