Split-n
type: LexicalEntry
canonical form: Split
sense: 08836868-n
part of speech: noun

08836868-n
type: LexicalConcept
in scheme: en-word.net
definition: an old Croatian city on the Adriatic Sea
ili: i83186
lexfile: noun.location
part of speech: noun
instance hypernym: 08542298-n