Speer-n
type: LexicalEntry
canonical form: Speer
sense: 11329953-n
part of speech: noun

Albert Speer-n
type: LexicalEntry
canonical form: Albert Speer
sense: 11329953-n
part of speech: noun

11329953-n
type: LexicalConcept
in scheme: en-word.net
definition: German Nazi architect who worked for Hitler (1905-1981)
ili: i96973
lexfile: noun.person
part of speech: noun
instance hypernym: 09824898-n