Sioux Falls-n
type: LexicalEntry
canonical form: Sioux Falls
sense: 09162571-n
part of speech: noun

09162571-n
type: LexicalConcept
in scheme: en-word.net
definition: largest city in South Dakota; located in southeastern South Dakota
ili: i84665
lexfile: noun.location
part of speech: noun
instance hypernym: 08542298-n