stonechat-n
type: LexicalEntry
canonical form: stonechat
sense: 01563434-n
part of speech: noun

Saxicola torquata-n
type: LexicalEntry
canonical form: Saxicola torquata
sense: 01563434-n
part of speech: noun

01563434-n
type: LexicalConcept
in scheme: en-word.net
definition: common European chat with black plumage and a reddish-brown breast
ili: i43470
lexfile: noun.animal
part of speech: noun
hypernym: 01563277-n