Russia-n
type: LexicalEntry
canonical form: Russia
sense: 09025184-n
part of speech: noun
sense: 09025654-n
sense: 09028783-n
sense: 09030093-n

09025184-n
type: LexicalConcept
in scheme: en-word.net
definition:
  value: a former empire in eastern Europe and northern Asia created in the 14th century with Moscow as the capital; powerful in the 17th and 18th centuries under Peter the Great and Catherine the Great when Saint Petersburg was the capital; overthrown by revolution in 1917
ili: i83988
lexfile: noun.location
part of speech: noun
instance hypernym: 08575019-n
mero part: 09026288-n

Soviet Union-n
type: LexicalEntry
canonical form: Soviet Union
sense: 09025654-n
part of speech: noun

Union of Soviet Socialist Republics-n
type: LexicalEntry
canonical form: Union of Soviet Socialist Republics
sense: 09025654-n
part of speech: noun

USSR-n
type: LexicalEntry
canonical form: USSR
sense: 09025654-n
part of speech: noun

09025654-n
type: LexicalConcept
in scheme: en-word.net
definition:
  value: a former communist country in eastern Europe and northern Asia; established in 1922; included Russia and 14 other soviet socialist republics (Ukraine and Byelorussia and others); officially dissolved 31 December 1991
ili: i83989
lexfile: noun.location
part of speech: noun
instance hypernym: 08562388-n
mero part: 09028575-n
mero part: 09030093-n
mero part: 09260310-n

Russian Federation-n
type: LexicalEntry
canonical form: Russian Federation
sense: 09028783-n
part of speech: noun

09028783-n
type: LexicalConcept
in scheme: en-word.net
definition: a federation in northeastern Europe and northern Asia; formerly Soviet Russia; since 1991 an independent state
ili: i84002
lexfile: noun.location
part of speech: noun
instance hypernym: 08562388-n
mero part: 08797682-n
mero part: 09026438-n
mero part: 09026728-n
mero part: 09026865-n
mero part: 09026995-n
mero part: 09027362-n
mero part: 09027523-n
mero part: 09027643-n
mero part: 09027981-n
mero part: 09028082-n
mero part: 09029841-n
mero part: 09030500-n
mero part: 09030703-n
mero part: 09030824-n
mero part: 09031093-n
mero part: 09031363-n
mero part: 09031544-n
mero part: 09031742-n
mero part: 09031860-n
mero part: 09032063-n
mero part: 09032186-n
mero part: 09032348-n
mero part: 09032455-n
mero part: 09032670-n
mero part: 09032823-n
mero part: 09032935-n
mero part: 09033040-n
mero part: 09033155-n
mero part: 09033344-n
mero part: 09218981-n
mero part: 09291142-n
mero part: 09291684-n
mero part: 09354560-n
mero part: 09354725-n
mero part: 09355504-n
mero part: 09392755-n
mero part: 09481717-n
mero part: 09490315-n
mero part: 09494611-n
mero part: 09496369-n
mero part: 09496527-n

Russian Soviet Federative Socialist Republic-n
type: LexicalEntry
canonical form: Russian Soviet Federative Socialist Republic
sense: 09030093-n
part of speech: noun

Soviet Russia-n
type: LexicalEntry
canonical form: Soviet Russia
sense: 09030093-n
part of speech: noun

Russian Soviet Federated Socialist Republic-n
type: LexicalEntry
canonical form: Russian Soviet Federated Socialist Republic
sense: 09030093-n
part of speech: noun

09030093-n
type: LexicalConcept
in scheme: en-word.net
definition: formerly the largest Soviet Socialist Republic in the USSR occupying eastern Europe and northern Asia
ili: i84005
lexfile: noun.location
part of speech: noun
instance hypernym: 09028575-n
mero member: 09725651-n
mero member: 09725792-n
mero member: 09725944-n
mero member: 09726796-n
mero member: 09727388-n
mero member: 09727514-n
mero member: 09747745-n