De Niro-n
type: LexicalEntry
canonical form: De Niro
sense: 10950664-n
part of speech: noun

Robert De Niro-n
type: LexicalEntry
canonical form: Robert De Niro
sense: 10950664-n
part of speech: noun

10950664-n
type: LexicalConcept
in scheme: en-word.net
definition: United States film actor who frequently plays tough characters (born 1943)
ili: i94900
lexfile: noun.person
part of speech: noun
instance hypernym: 09784701-n