Turkey-n
type: LexicalEntry
canonical form: Turkey
sense: 09061886-n
part of speech: noun

Republic of Turkey-n
type: LexicalEntry
canonical form: Republic of Turkey
sense: 09061886-n
part of speech: noun

09061886-n
type: LexicalConcept
in scheme: en-word.net
definition: a Eurasian republic in Asia Minor and the Balkans; on the collapse of the Ottoman Empire in 1918, the Young Turks, led by Kemal Ataturk, established a republic in 1923
ili: i84158
lexfile: noun.location
part of speech: noun
instance hypernym: 08562388-n
mero member: 09754317-n
mero part: 08935884-n
mero part: 09061465-n
mero part: 09062774-n
mero part: 09062950-n
mero part: 09063076-n
mero part: 09063314-n
mero part: 09063473-n
mero part: 09063846-n
mero part: 09064057-n
mero part: 09064260-n
mero part: 09064688-n
mero part: 09064797-n
mero part: 09064926-n
mero part: 09065150-n
mero part: 09211791-n
mero part: 09225910-n
mero part: 09226095-n
mero part: 09250126-n
mero part: 09297645-n
mero part: 09454037-n
mero part: 09481921-n