Shankar-n
type: LexicalEntry
canonical form: Shankar
sense: 11315454-n
part of speech: noun

Ravi Shankar-n
type: LexicalEntry
canonical form: Ravi Shankar
sense: 11315454-n
part of speech: noun

11315454-n
type: LexicalConcept
in scheme: en-word.net
definition: Indian sitar player who popularized classical Indian music in the West (born in 1920)
ili: i96888
lexfile: noun.person
part of speech: noun
instance hypernym: 10623259-n