Ramayana-n
type: LexicalEntry
canonical form: Ramayana
sense: 06475694-n
part of speech: noun

06475694-n
type: LexicalConcept
in scheme: en-word.net
definition: one of two classical Hindu epics telling of the banishment of Rama from his kingdom and the abduction of his wife by a demon and Rama's restoration to the throne
ili: i70426
lexfile: noun.communication
part of speech: noun
instance hypernym: 06475017-n