Queen of England-n
type: LexicalEntry
canonical form: Queen of England
sense: 10519216-n
part of speech: noun

10519216-n
type: LexicalConcept
in scheme: en-word.net
definition: the sovereign ruler of England when female
ili: i92394
lexfile: noun.person
part of speech: noun
hypernym: 10518940-n