Victoria-n
type: LexicalEntry
canonical form: Victoria
sense: 11385852-n
part of speech: noun

Queen Victoria-n
type: LexicalEntry
canonical form: Queen Victoria
sense: 11385852-n
part of speech: noun

11385852-n
type: LexicalConcept
in scheme: en-word.net
definition: queen of Great Britain and Ireland and empress of India from 1837 to 1901; the last Hanoverian ruler of England (1819-1901)
ili: i97297
lexfile: noun.person
part of speech: noun
instance hypernym: 10519216-n
instance hypernym: 10073247-n