Quebec-n
type: LexicalEntry
canonical form: Quebec
sense: 08848309-n
part of speech: noun

Quebec City-n
type: LexicalEntry
canonical form: Quebec City
sense: 08848309-n
part of speech: noun

08848309-n
type: LexicalConcept
in scheme: en-word.net
definition: the French-speaking capital of the province of Quebec; situated on the Saint Lawrence River
ili: i83235
lexfile: noun.location
part of speech: noun
instance hypernym: 08713012-n
mero part: 03940692-n
mero part: 04039654-n