Providence-n
type: LexicalEntry
canonical form: Providence
sense: 09160159-n
part of speech: noun

capital of Rhode Island-n
type: LexicalEntry
canonical form: capital of Rhode Island
sense: 09160159-n
part of speech: noun

09160159-n
type: LexicalConcept
in scheme: en-word.net
definition: the capital and largest city of Rhode Island; located in northeastern Rhode Island on Narragansett Bay; site of Brown University
ili: i84653
lexfile: noun.location
part of speech: noun
instance hypernym: 08713353-n