Pretoria-n
type: LexicalEntry
canonical form: Pretoria
sense: 09022642-n
part of speech: noun

capital of South Africa-n
type: LexicalEntry
canonical form: capital of South Africa
sense: 09022642-n
part of speech: noun

09022642-n
type: LexicalConcept
in scheme: en-word.net
definition: city in the Transvaal; the seat of the executive branch of the government of South Africa
ili: i83974
lexfile: noun.location
part of speech: noun
instance hypernym: 08709407-n