Philip II-n
type: LexicalEntry
canonical form: Philip II
sense: 11252605-n
part of speech: noun

Philip II of Spain-n
type: LexicalEntry
canonical form: Philip II of Spain
sense: 11252605-n
part of speech: noun

11252605-n
type: LexicalConcept
in scheme: en-word.net
definition: king of Spain and Portugal and husband of Mary I; he supported the Counter Reformation and sent the Spanish Armada to invade England (1527-1598)
ili: i96554
lexfile: noun.person
part of speech: noun
instance hypernym: 10251212-n