Philip II-n
type: LexicalEntry
canonical form: Philip II
sense: 11252605-n
part of speech: noun
sense: 11252827-n
sense: 11252979-n

Philip II of Spain-n
type: LexicalEntry
canonical form: Philip II of Spain
sense: 11252605-n
part of speech: noun

11252605-n
type: LexicalConcept
in scheme: en-word.net
definition: king of Spain and Portugal and husband of Mary I; he supported the Counter Reformation and sent the Spanish Armada to invade England (1527-1598)
ili: i96554
lexfile: noun.person
part of speech: noun
instance hypernym: 10251212-n

Philip II of Macedon-n
type: LexicalEntry
canonical form: Philip II of Macedon
sense: 11252827-n
part of speech: noun

11252827-n
type: LexicalConcept
in scheme: en-word.net
definition: king of ancient Macedonia and father of Alexander the Great (382-336 BC)
ili: i96555
lexfile: noun.person
part of speech: noun
instance hypernym: 10251212-n

Philip II of France-n
type: LexicalEntry
canonical form: Philip II of France
sense: 11252979-n
part of speech: noun

Philip Augustus-n
type: LexicalEntry
canonical form: Philip Augustus
sense: 11252979-n
part of speech: noun

11252979-n
type: LexicalConcept
in scheme: en-word.net
definition: son of Louis VII whose reign as king of France saw wars with the English that regained control of Normandy and Anjou and most of Poitou (1165-1223)
ili: i96556
lexfile: noun.person
part of speech: noun
instance hypernym: 10251212-n