Cooper-n
type: LexicalEntry
canonical form: Cooper
sense: 10929223-n
part of speech: noun

Peter Cooper-n
type: LexicalEntry
canonical form: Peter Cooper
sense: 10929223-n
part of speech: noun

10929223-n
type: LexicalConcept
in scheme: en-word.net
definition: United States industrialist who built the first American locomotive; founded Cooper Union in New York City to offer free courses in the arts and sciences (1791-1883)
ili: i94783
lexfile: noun.person
part of speech: noun
instance hypernym: 10223796-n
instance hypernym: 10441701-n