Lowell-n
type: LexicalEntry
canonical form: Lowell
sense: 11162604-n
part of speech: noun

Percival Lowell-n
type: LexicalEntry
canonical form: Percival Lowell
sense: 11162604-n
part of speech: noun

11162604-n
type: LexicalConcept
in scheme: en-word.net
definition: United States astronomer whose studies of Mars led him to conclude that Mars was inhabited (1855-1916)
ili: i96032
lexfile: noun.person
part of speech: noun
instance hypernym: 09837748-n