Pegasus-n
type: LexicalEntry
canonical form: Pegasus
sense: 09411423-n
part of speech: noun
sense: 09523757-n

09411423-n
type: LexicalConcept
in scheme: en-word.net
definition: a constellation in the Northern Hemisphere near Andromeda and Pisces
ili: i85956
lexfile: noun.object
part of speech: noun
instance hypernym: 09275876-n

09523757-n
type: LexicalConcept
in scheme: en-word.net
definition:
  value: (Greek mythology) the immortal winged horse that sprang from the blood of the slain Medusa; was tamed by Bellerophon with the help of a bridle given him by Athena; as the flying horse of the Muses it is a symbol of highflying imagination
ili: i86547
lexfile: noun.person
part of speech: noun
domain topic: 07995848-n
instance hypernym: 09507794-n