opium poppy-n
type: LexicalEntry
canonical form: opium poppy
sense: 11922858-n
part of speech: noun

Papaver somniferum-n
type: LexicalEntry
canonical form: Papaver somniferum
sense: 11922858-n
part of speech: noun

11922858-n
type: LexicalConcept
in scheme: en-word.net
definition: southwestern Asian herb with greyish leaves and white or reddish flowers; source of opium
ili: i99795
lexfile: noun.plant
part of speech: noun
hypernym: 11921038-n
mero part: 07843726-n