Papal States-n
type: LexicalEntry
canonical form: Papal States
sense: 08827448-n
part of speech: noun

08827448-n
type: LexicalConcept
in scheme: en-word.net
definition: the temporal dominions belonging to the pope (especially in central Italy)
ili: i83140
lexfile: noun.location
part of speech: noun
instance hypernym: 08569713-n