Ovid-n
type: LexicalEntry
canonical form: Ovid
sense: 11238766-n
part of speech: noun

Publius Ovidius Naso-n
type: LexicalEntry
canonical form: Publius Ovidius Naso
sense: 11238766-n
part of speech: noun

11238766-n
type: LexicalConcept
in scheme: en-word.net
definition: Roman poet remembered for his elegiac verses on love (43 BC - AD 17)
ili: i96478
lexfile: noun.person
part of speech: noun
instance hypernym: 10463768-n