Hassel-n
type: LexicalEntry
canonical form: Hassel
sense: 11054163-n
part of speech: noun

Odd Hassel-n
type: LexicalEntry
canonical form: Odd Hassel
sense: 11054163-n
part of speech: noun

11054163-n
type: LexicalConcept
in scheme: en-word.net
definition: Norwegian chemist noted for his research on organic molecules (1897-1981)
ili: i95445
lexfile: noun.person
part of speech: noun
instance hypernym: 09933282-n