Nox-n
type: LexicalEntry
canonical form: Nox
sense: 09582898-n
part of speech: noun

Night-n
type: LexicalEntry
canonical form: Night
sense: 09582898-n
part of speech: noun

09582898-n
type: LexicalConcept
in scheme: en-word.net
definition: Roman goddess of night; daughter of Erebus; counterpart of Greek Nyx
ili: i86897
lexfile: noun.person
part of speech: noun
instance hypernym: 09575810-n