Niger-n
type: LexicalEntry
canonical form: Niger
sense: 09394062-n
part of speech: noun

Niger River-n
type: LexicalEntry
canonical form: Niger River
sense: 09394062-n
part of speech: noun

09394062-n
type: LexicalConcept
in scheme: en-word.net
definition: an African river; flows into the South Atlantic
ili: i85870
lexfile: noun.object
part of speech: noun
instance hypernym: 09434308-n