Newfoundland and Labrador-n
type: LexicalEntry
canonical form: Newfoundland and Labrador
sense: 08843929-n
part of speech: noun

08843929-n
type: LexicalConcept
in scheme: en-word.net
definition: a Canadian province on the island of Newfoundland and on the mainland along the coast of the Labrador Sea; became Canada's 10th province in 1949
ili: i83212
lexfile: noun.location
part of speech: noun
instance hypernym: 08840877-n
mero part: 08837735-n
mero part: 08844313-n