Newfoundland-n
type: LexicalEntry
canonical form: Newfoundland
sense: 02113929-n
part of speech: noun
sense: 08844203-n

Newfoundland dog-n
type: LexicalEntry
canonical form: Newfoundland dog
sense: 02113929-n
part of speech: noun

02113929-n
type: LexicalConcept
in scheme: en-word.net
definition: a breed of very large heavy dogs with a thick coarse usually black coat; highly intelligent dogs and vigorous swimmers; developed in Newfoundland
ili: i46531
lexfile: noun.animal
part of speech: noun
hypernym: 02086723-n

08844203-n
type: LexicalConcept
in scheme: en-word.net
definition: an island in the north Atlantic
ili: i83213
lexfile: noun.location
part of speech: noun
instance hypernym: 09339360-n