Netherlands Antilles-n
type: LexicalEntry
canonical form: Netherlands Antilles
sense: 08766332-n
part of speech: noun

08766332-n
type: LexicalConcept
in scheme: en-word.net
definition: a group of islands in the Lesser Antilles just to the north of Venezuela that are administered by The Netherlands
ili: i82862
lexfile: noun.location
part of speech: noun
instance hypernym: 09339360-n
mero part: 08766627-n
mero part: 08766750-n
mero part: 08766875-n
mero part: 08767000-n
mero part: 08767145-n