Nepal-n
type: LexicalEntry
canonical form: Nepal
sense: 08926147-n
part of speech: noun

Kingdom of Nepal-n
type: LexicalEntry
canonical form: Kingdom of Nepal
sense: 08926147-n
part of speech: noun

08926147-n
type: LexicalConcept
in scheme: en-word.net
definition: a small landlocked Asian country high in the Himalayas between India and China
ili: i83548
lexfile: noun.location
part of speech: noun
instance hypernym: 08718069-n
mero member: 09743480-n
mero member: 09752442-n
mero part: 08926582-n
mero part: 09220823-n
mero part: 09263953-n
mero part: 09289359-n
mero part: 09299916-n
mero part: 09326553-n
mero part: 09346127-n
mero part: 09361618-n
mero part: 09369181-n
mero part: 09398605-n