Napier-n
type: LexicalEntry
canonical form: Napier
sense: 11220080-n
part of speech: noun

John Napier-n
type: LexicalEntry
canonical form: John Napier
sense: 11220080-n
part of speech: noun

11220080-n
type: LexicalConcept
in scheme: en-word.net
definition: Scottish mathematician who invented logarithms; introduced the use of the decimal point in writing numbers (1550-1617)
ili: i96367
lexfile: noun.person
part of speech: noun
instance hypernym: 10320928-n